{"text_format":"3","workbook":"xlsx","n_sheets":3,"sheets":["专业排名汇总表","必修课排名","综测排名"],"not_rendered":{"defined_names":3},"read":"whole","date_system":"1900"}

{"sheet":"专业排名汇总表","index":0,"n_rows":168,"n_cols":31,"rows_kept":168,"merged":[[0,0,1,0],[0,1,1,1],[0,2,1,2],[0,3,1,3],[0,4,1,4],[0,5,1,5],[0,6,0,13],[0,14,0,19],[0,20,0,26],[0,27,1,27],[0,28,1,28],[0,29,1,29],[0,30,1,30]]}
["学号","排名"," 必修课排名","学号","姓名","班级","德育成绩",{"$nulls":7},"智育成绩",{"$nulls":5},"体育成绩",{"$nulls":6},"综合测评总分","必修课优良率","体测是否一次性通过","是否挂科"]
[{"$nulls":6},"班级互评分","辅导员打分","班级互评分×0.6","辅导员打分×0.4","德育加分","德育扣分","德育成绩","德育成绩×0.2","必修课加权平均分","选修课加权平均分","智育成绩（必修课×0.8+选修课×0.2）","智育加分","智育成绩","智育成绩×0.7","体育课成绩","平时成绩","体育课成绩×0.6","平时成绩×0.4","体育加分","体育成绩","体育成绩×0.1"]
[2022010364,145,132,2022010376,"刘珣","化工类22-1",{"v":99.4518034964586,"d":"99.4518"},{"v":90,"d":"90.0000"},{"v":59.67108209787516,"d":"59.6711"},{"v":36,"d":"36.0000"},{"v":3,"d":"3.0000"},{"v":0,"d":"0.0000"},{"v":98.67108209787516,"d":"98.6711"},{"v":19.734216419575034,"d":"19.7342"},{"v":73.6951219512195,"d":"73.6951"},{"v":72,"d":"72.0000"},{"v":73.35609756097561,"d":"73.3561"},{"v":0,"d":"0.0000"},{"v":73.35609756097561,"d":"73.3561"},{"v":51.34926829268293,"d":"51.3493"},{"v":69.5,"d":"69.5000"},{"v":57.2,"d":"57.2000"},{"v":41.699999999999996,"d":"41.7000"},{"v":22.880000000000003,"d":"22.8800"},{"v":0,"d":"0.0000"},{"v":64.58,"d":"64.5800"},{"v":6.458,"d":"6.4580"},{"v":77.54148471225795,"d":"77.5415"},{"v":0.6,"d":"60.0000%"},"否","是"]
[2022010365,98,64,2022010377,"刘超","化工类22-1",{"v":99.4518034964586,"d":"99.4518"},{"v":90,"d":"90.0000"},{"v":59.67108209787516,"d":"59.6711"},{"v":36,"d":"36.0000"},{"v":0,"d":"0.0000"},{"v":0,"d":"0.0000"},{"v":95.67108209787516,"d":"95.6711"},{"v":19.134216419575033,"d":"19.1342"},{"v":81.2517647058824,"d":"81.2518"},{"v":87.3333333333333,"d":"87.3333"},{"v":82.46807843137259,"d":"82.4681"},{"v":0,"d":"0.0000"},{"v":82.46807843137259,"d":"82.4681"},{"v":57.72765490196081,"d":"57.7277"},{"v":66,"d":"66.0000"},{"v":56.5,"d":"56.5000"},{"v":39.6,"d":"39.6000"},{"v":22.6,"d":"22.6000"},{"v":0,"d":"0.0000"},{"v":62.2,"d":"62.2000"},{"v":6.220000000000001,"d":"6.2200"},{"v":83.08187132153584,"d":"83.0819"},{"v":0.6,"d":"60.0000%"},"否","否"]
[2022010366,89,93,2022010379,"孙科","化工类22-1",{"v":99.0901605746533,"d":"99.0902"},{"v":90,"d":"90.0000"},{"v":59.45409634479198,"d":"59.4541"},{"v":36,"d":"36.0000"},{"v":8.469999999999999,"d":"8.4700"},{"v":0,"d":"0.0000"},{"v":103.92409634479198,"d":"103.9241"},{"v":20.784819268958397,"d":"20.7848"},{"v":78.4023529411765,"d":"78.4024"},{"v":86.3333333333333,"d":"86.3333"},{"v":79.98854901960787,"d":"79.9885"},{"v":0,"d":"0.0000"},{"v":79.98854901960787,"d":"79.9885"},{"v":55.99198431372551,"d":"55.9920"},{"v":74,"d":"74.0000"},{"v":58,"d":"58.0000"},{"v":44.4,"d":"44.4000"},{"v":23.200000000000003,"d":"23.2000"},{"v":8,"d":"8.0000"},{"v":75.6,"d":"75.6000"},{"v":7.56,"d":"7.5600"},{"v":84.33680358268391,"d":"84.3368"},{"v":0.65,"d":"65.0000%"},"否","是"]
[2022010367,163,163,2022010380,"张茂霖","化工类22-1",{"v":99.4518034964586,"d":"99.4518"},{"v":90,"d":"90.0000"},{"v":59.67108209787516,"d":"59.6711"},{"v":36,"d":"36.0000"},{"v":0,"d":"0.0000"},{"v":-2,"d":"(2.0000)"},{"v":93.67108209787516,"d":"93.6711"},{"v":18.73421641957503,"d":"18.7342"},{"v":61.5121951219512,"d":"61.5122"},{"v":71.3333333333333,"d":"71.3333"},{"v":63.47642276422762,"d":"63.4764"},{"v":0,"d":"0.0000"},{"v":63.47642276422762,"d":"63.4764"},{"v":44.43349593495933,"d":"44.4335"},{"v":61.5,"d":"61.5000"},{"v":52.7,"d":"52.7000"},{"v":36.9,"d":"36.9000"},{"v":21.080000000000002,"d":"21.0800"},{"v":8,"d":"8.0000"},{"v":65.98,"d":"65.9800"},{"v":6.598000000000001,"d":"6.5980"},{"v":69.76571235453436,"d":"69.7657"},{"v":0.25,"d":"25.0000%"},"否","是"]
[2022010368,158,162,2022010381,"耿智盖灵","化工类22-1",{"v":99.4518034964586,"d":"99.4518"},{"v":90,"d":"90.0000"},{"v":59.67108209787516,"d":"59.6711"},{"v":36,"d":"36.0000"},{"v":0,"d":"0.0000"},{"v":0,"d":"0.0000"},{"v":95.67108209787516,"d":"95.6711"},{"v":19.134216419575033,"d":"19.1342"},{"v":64,"d":"64.0000"},{"v":91.3333333333333,"d":"91.3333"},{"v":69.46666666666667,"d":"69.4667"},{"v":0,"d":"0.0000"},{"v":69.46666666666667,"d":"69.4667"},{"v":48.626666666666665,"d":"48.6267"},{"v":60,"d":"60.0000"},{"v":53.2,"d":"53.2000"},{"v":36,"d":"36.0000"},{"v":21.28,"d":"21.2800"},{"v":8,"d":"8.0000"},{"v":65.28,"d":"65.2800"},{"v":6.5280000000000005,"d":"6.5280"},{"v":74.28888308624171,"d":"74.2889"},{"v":0.3,"d":"30.0000%"},"否","是"]
[2022010369,34,12,2022010383,"刘子瑞","化工类22-1",{"v":99.3011189457064,"d":"99.3011"},{"v":90,"d":"90.0000"},{"v":59.58067136742384,"d":"59.5807"},{"v":36,"d":"36.0000"},{"v":3,"d":"3.0000"},{"v":0,"d":"0.0000"},{"v":98.58067136742383,"d":"98.5807"},{"v":19.71613427348477,"d":"19.7161"},{"v":88.2376470588235,"d":"88.2376"},{"v":92,"d":"92.0000"},{"v":88.99011764705881,"d":"88.9901"},{"v":0,"d":"0.0000"},{"v":88.99011764705881,"d":"88.9901"},{"v":62.29308235294116,"d":"62.2931"},{"v":70,"d":"70.0000"},{"v":58.8,"d":"58.8000"},{"v":42,"d":"42.0000"},{"v":23.52,"d":"23.5200"},{"v":8,"d":"8.0000"},{"v":73.52,"d":"73.5200"},{"v":7.352,"d":"7.3520"},{"v":89.36121662642594,"d":"89.3612"},{"v":0.85,"d":"85.0000%"},"否","否"]
[2022010370,78,35,2022010384,"吴立新","化工类22-1",{"v":99.4518034964586,"d":"99.4518"},{"v":90,"d":"90.0000"},{"v":59.67108209787516,"d":"59.6711"},{"v":36,"d":"36.0000"},{"v":3,"d":"3.0000"},{"v":0,"d":"0.0000"},{"v":98.67108209787516,"d":"98.6711"},{"v":19.734216419575034,"d":"19.7342"},{"v":85.1176470588235,"d":"85.1176"},{"v":84,"d":"84.0000"},{"v":84.89411764705879,"d":"84.8941"},{"v":0,"d":"0.0000"},{"v":84.89411764705879,"d":"84.8941"},{"v":59.42588235294115,"d":"59.4259"},{"v":73,"d":"73.0000"},{"v":55.6,"d":"55.6000"},{"v":43.8,"d":"43.8000"},{"v":22.240000000000002,"d":"22.2400"},{"v":0,"d":"0.0000"},{"v":66.03999999999999,"d":"66.0400"},{"v":6.603999999999999,"d":"6.6040"},{"v":85.76409877251619,"d":"85.7641"},{"v":0.85,"d":"85.0000%"},"否","否"]
[2022010371,143,152,2022010391,"王禹程","化工类22-1",{"v":99.4518034964586,"d":"99.4518"},{"v":90,"d":"90.0000"},{"v":59.67108209787516,"d":"59.6711"},{"v":36,"d":"36.0000"},{"v":0,"d":"0.0000"},{"v":0,"d":"0.0000"},{"v":95.67108209787516,"d":"95.6711"},{"v":19.134216419575033,"d":"19.1342"},{"v":70.019512195122,"d":"70.0195"},{"v":94.2666666666667,"d":"94.2667"},{"v":74.86894308943094,"d":"74.8689"},{"v":0,"d":"0.0000"},{"v":74.86894308943094,"d":"74.8689"},{"v":52.40826016260166,"d":"52.4083"},{"v":74,"d":"74.0000"},{"v":56,"d":"56.0000"},{"v":44.4,"d":"44.4000"},{"v":22.400000000000002,"d":"22.4000"},{"v":0,"d":"0.0000"},{"v":66.8,"d":"66.8000"},{"v":6.68,"d":"6.6800"},{"v":78.22247658217668,"d":"78.2225"},{"v":0.6,"d":"60.0000%"},"否","是"]
[2022010372,90,79,2022012312,"徐峥","化工类22-1",{"v":98.5778331020958,"d":"98.5778"},{"v":90,"d":"90.0000"},{"v":59.146699861257474,"d":"59.1467"},{"v":36,"d":"36.0000"},{"v":3.5,"d":"3.5000"},{"v":0,"d":"0.0000"},{"v":98.64669986125747,"d":"98.6467"},{"v":19.729339972251495,"d":"19.7293"},{"v":79.5082352941176,"d":"79.5082"},{"v":89.1111111111111,"d":"89.1111"},{"v":81.4288104575163,"d":"81.4288"},{"v":2,"d":"2.0000"},{"v":83.4288104575163,"d":"83.4288"},{"v":58.40016732026141,"d":"58.4002"},{"v":66.5,"d":"66.5000"},{"v":53.7,"d":"53.7000"},{"v":39.9,"d":"39.9000"},{"v":21.480000000000004,"d":"21.4800"},{"v":0,"d":"0.0000"},{"v":61.38,"d":"61.3800"},{"v":6.138000000000001,"d":"6.1380"},{"v":84.2675072925129,"d":"84.2675"},{"v":0.65,"d":"65.0000%"},"否","否"]
[2022010373,122,122,2022010396,"邵兰贺","化工类22-2",{"v":98.300368513344,"d":"98.3004"},{"v":90,"d":"90.0000"},{"v":58.9802211080064,"d":"58.9802"},{"v":36,"d":"36.0000"},{"v":6.25,"d":"6.2500"},{"v":0,"d":"0.0000"},{"v":101.23022110800639,"d":"101.2302"},{"v":20.24604422160128,"d":"20.2460"},{"v":74.7487804878049,"d":"74.7488"},{"v":71.9666666666667,"d":"71.9667"},{"v":74.19235772357726,"d":"74.1924"},{"v":2,"d":"2.0000"},{"v":76.19235772357726,"d":"76.1924"},{"v":53.33465040650408,"d":"53.3347"},{"v":79,"d":"79.0000"},{"v":55.5,"d":"55.5000"},{"v":47.4,"d":"47.4000"},{"v":22.200000000000003,"d":"22.2000"},{"v":4,"d":"4.0000"},{"v":73.6,"d":"73.6000"},{"v":7.359999999999999,"d":"7.3600"},{"v":80.94069462810536,"d":"80.9407"},{"v":0.55,"d":"55.0000%"},"否","是"]
[2022010374,123,102,2022010403,"成思宇","化工类22-2",{"v":99.2458778622286,"d":"99.2459"},{"v":90,"d":"90.0000"},{"v":59.547526717337156,"d":"59.5475"},{"v":36,"d":"36.0000"},{"v":5.95,"d":"5.9500"},{"v":0,"d":"0.0000"},{"v":101.49752671733715,"d":"101.4975"},{"v":20.29950534346743,"d":"20.2995"},{"v":77.4634146341463,"d":"77.4634"},{"v":88.1,"d":"88.1000"},{"v":79.59073170731705,"d":"79.5907"},{"v":0,"d":"0.0000"},{"v":79.59073170731705,"d":"79.5907"},{"v":55.71351219512193,"d":"55.7135"},{"v":53,"d":"53.0000"},{"v":29,"d":"29.0000"},{"v":31.799999999999997,"d":"31.8000"},{"v":11.600000000000001,"d":"11.6000"},{"v":0,"d":"0.0000"},{"v":43.4,"d":"43.4000"},{"v":4.34,"d":"4.3400"},{"v":80.35301753858937,"d":"80.3530"},{"v":0.55,"d":"55.0000%"},"否","是"]
[2022010376,103,76,2022010414,"潘恒懿","化工类22-2",{"v":98.8546326144143,"d":"98.8546"},{"v":90,"d":"90.0000"},{"v":59.31277956864858,"d":"59.3128"},{"v":36,"d":"36.0000"},{"v":4.8,"d":"4.8000"},{"v":0,"d":"0.0000"},{"v":100.11277956864858,"d":"100.1128"},{"v":20.022555913729718,"d":"20.0226"},{"v":79.8117647058824,"d":"79.8118"},{"v":77.3333333333333,"d":"77.3333"},{"v":79.31607843137257,"d":"79.3161"},{"v":0,"d":"0.0000"},{"v":79.31607843137257,"d":"79.3161"},{"v":55.5212549019608,"d":"55.5213"},{"v":80,"d":"80.0000"},{"v":55.7,"d":"55.7000"},{"v":48,"d":"48.0000"},{"v":22.28,"d":"22.2800"},{"v":0,"d":"0.0000"},{"v":70.28,"d":"70.2800"},{"v":7.0280000000000005,"d":"7.0280"},{"v":82.57181081569053,"d":"82.5718"},{"v":0.4,"d":"40.0000%"},"否","否"]
[2022010377,146,141,2022010417,"段少坤","化工类22-2",{"v":99.1154627796238,"d":"99.1155"},{"v":90,"d":"90.0000"},{"v":59.46927766777428,"d":"59.4693"},{"v":36,"d":"36.0000"},{"v":0,"d":"0.0000"},{"v":0,"d":"0.0000"},{"v":95.46927766777428,"d":"95.4693"},{"v":19.093855533554855,"d":"19.0939"},{"v":71.4487804878049,"d":"71.4488"},{"v":84.0666666666667,"d":"84.0667"},{"v":73.97235772357726,"d":"73.9724"},{"v":0,"d":"0.0000"},{"v":73.97235772357726,"d":"73.9724"},{"v":51.78065040650408,"d":"51.7807"},{"v":69.5,"d":"69.5000"},{"v":44.5,"d":"44.5000"},{"v":41.699999999999996,"d":"41.7000"},{"v":17.8,"d":"17.8000"},{"v":0,"d":"0.0000"},{"v":59.5,"d":"59.5000"},{"v":5.95,"d":"5.9500"},{"v":76.82450594005894,"d":"76.8245"},{"v":0.3,"d":"30.0000%"},"否","是"]
[2022010378,150,150,2022010420,"曹坤阳","化工类22-2",{"v":99.0176514676702,"d":"99.0177"},{"v":90,"d":"90.0000"},{"v":59.41059088060212,"d":"59.4106"},{"v":36,"d":"36.0000"},{"v":0,"d":"0.0000"},{"v":0,"d":"0.0000"},{"v":95.41059088060211,"d":"95.4106"},{"v":19.082118176120424,"d":"19.0821"},{"v":70.619512195122,"d":"70.6195"},{"v":87.6,"d":"87.6000"},{"v":74.0156097560976,"d":"74.0156"},{"v":0,"d":"0.0000"},{"v":74.0156097560976,"d":"74.0156"},{"v":51.81092682926832,"d":"51.8109"},{"v":69.5,"d":"69.5000"},{"v":28.2,"d":"28.2000"},{"v":41.699999999999996,"d":"41.7000"},{"v":11.280000000000001,"d":"11.2800"},{"v":0,"d":"0.0000"},{"v":52.98,"d":"52.9800"},{"v":5.298,"d":"5.2980"},{"v":76.19104500538874,"d":"76.1910"},{"v":0.45,"d":"45.0000%"},"否","是"]
[2022010379,133,120,2022010424,"席振昌","化工类22-2",{"v":99.1154627796238,"d":"99.1155"},{"v":90,"d":"90.0000"},{"v":59.46927766777428,"d":"59.4693"},{"v":36,"d":"36.0000"},{"v":0,"d":"0.0000"},{"v":0,"d":"0.0000"},{"v":95.46927766777428,"d":"95.4693"},{"v":19.093855533554855,"d":"19.0939"},{"v":74.9011764705882,"d":"74.9012"},{"v":83,"d":"83.0000"},{"v":76.52094117647056,"d":"76.5209"},{"v":0,"d":"0.0000"},{"v":76.52094117647056,"d":"76.5209"},{"v":53.564658823529385,"d":"53.5647"},{"v":74.5,"d":"74.5000"},{"v":55,"d":"55.0000"},{"v":44.699999999999996,"d":"44.7000"},{"v":22,"d":"22.0000"},{"v":0,"d":"0.0000"},{"v":66.69999999999999,"d":"66.7000"},{"v":6.669999999999999,"d":"6.6700"},{"v":79.32851435708425,"d":"79.3285"},{"v":0.45,"d":"45.0000%"},"否","是"]
[2022010380,110,71,2022010426,"赵群","化工类22-2",{"v":98.9198401557167,"d":"98.9198"},{"v":90,"d":"90.0000"},{"v":59.351904093430015,"d":"59.3519"},{"v":36,"d":"36.0000"},{"v":0,"d":"0.0000"},{"v":0,"d":"0.0000"},{"v":95.35190409343002,"d":"95.3519"},{"v":19.070380818686004,"d":"19.0704"},{"v":80.32,"d":"80.3200"},{"v":81.6666666666667,"d":"81.6667"},{"v":80.58933333333334,"d":"80.5893"},{"v":0,"d":"0.0000"},{"v":80.58933333333334,"d":"80.5893"},{"v":56.412533333333336,"d":"56.4125"},{"v":72.5,"d":"72.5000"},{"v":55.1,"d":"55.1000"},{"v":43.5,"d":"43.5000"},{"v":22.040000000000003,"d":"22.0400"},{"v":0,"d":"0.0000"},{"v":65.54,"d":"65.5400"},{"v":6.554000000000001,"d":"6.5540"},{"v":82.03691415201934,"d":"82.0369"},{"v":0.5,"d":"50.0000%"},"否","否"]
[2022010381,128,100,2022010427,"周慧林","化工类22-2",{"v":99.2458778622286,"d":"99.2459"},{"v":90,"d":"90.0000"},{"v":59.547526717337156,"d":"59.5475"},{"v":36,"d":"36.0000"},{"v":0,"d":"0.0000"},{"v":0,"d":"0.0000"},{"v":95.54752671733715,"d":"95.5475"},{"v":19.10950534346743,"d":"19.1095"},{"v":77.6988235294118,"d":"77.6988"},{"v":76.8571428571429,"d":"76.8571"},{"v":77.53048739495802,"d":"77.5305"},{"v":0,"d":"0.0000"},{"v":77.53048739495802,"d":"77.5305"},{"v":54.27134117647061,"d":"54.2713"},{"v":67,"d":"67.0000"},{"v":54.7,"d":"54.7000"},{"v":40.199999999999996,"d":"40.2000"},{"v":21.880000000000003,"d":"21.8800"},{"v":0,"d":"0.0000"},{"v":62.08,"d":"62.0800"},{"v":6.208,"d":"6.2080"},{"v":79.58884651993803,"d":"79.5888"},{"v":0.35,"d":"35.0000%"},"否","否"]
[2022010382,155,153,2022012313,"巴合加娜提·加冷","化工类22-2",{"v":99.0828590089726,"d":"99.0829"},{"v":90,"d":"90.0000"},{"v":59.44971540538356,"d":"59.4497"},{"v":36,"d":"36.0000"},{"v":1.95,"d":"1.9500"},{"v":0,"d":"0.0000"},{"v":97.39971540538356,"d":"97.3997"},{"v":19.479943081076712,"d":"19.4799"},{"v":69.9634146341463,"d":"69.9634"},{"v":78.6666666666667,"d":"78.6667"},{"v":71.70406504065039,"d":"71.7041"},{"v":0,"d":"0.0000"},{"v":71.70406504065039,"d":"71.7041"},{"v":50.19284552845527,"d":"50.1928"},{"v":72,"d":"72.0000"},{"v":42.6,"d":"42.6000"},{"v":43.199999999999996,"d":"43.2000"},{"v":17.040000000000003,"d":"17.0400"},{"v":0,"d":"0.0000"},{"v":60.239999999999995,"d":"60.2400"},{"v":6.024,"d":"6.0240"},{"v":75.69678860953198,"d":"75.6968"},{"v":0.3,"d":"30.0000%"},"否","是"]
{"$rows_left_out":149}
{"sheet":"必修课排名","index":1,"n_rows":167,"n_cols":8,"rows_kept":167,"hidden":true}
["学号","姓名","智育成绩","排名"]
[2022010455,"王德民",92.9024390243902,1,null,null,2022010364,{"$f":"VLOOKUP(G2,A:D,4,0)","v":52}]
[2022010368,"张露",91.909756097561,2,null,null,2022010365,29]
[2022010498,"陈雨涵",91.285,3,null,null,2022010366,65]
[2022010452,"康胜",91.1929411764706,4,null,null,2022010367,94]
[2022010466,"李春辉",90.9561643835616,5,null,null,2022010368,2]
[2022010408,"许文轲",90.5505882352941,6,null,null,2022010369,110]
[2022010373,"王晴宇",90.4588235294118,7,null,null,2022010370,136]
[2022010434,"黄宁",88.8328767123288,8,null,null,2022010371,81]
[2022010407,"叶海宇",88.7411764705882,9,null,null,2022010372,68]
[2022010392,"吴照飞",88.4894117647059,10,null,null,2022010373,7]
[2022010397,"李安然",88.2682352941176,11,null,null,2022010374,14]
[2022010383,"刘子瑞",88.2376470588235,12,null,null,2022010376,132]
[2022010451,"蒋子强",88.1951219512195,13,null,null,2022010377,64]
[2022010374,"袁佳怡",88.1741176470588,14,null,null,2022010378,46]
[2022010387,"陈方旭",88.009756097561,15,null,null,2022010379,93]
[2022010436,"孙涵",88.0073170731707,16,null,null,2022010380,163]
[2022010478,"李煌",87.9882352941176,17,null,null,2022010381,162]
[2022010393,"徐森",87.7425,18,null,null,2022010382,56]
[2022010386,"李陶然",87.7294117647059,19,null,null,2022010383,12]
{"$rows_left_out":148}
{"sheet":"综测排名","index":2,"n_rows":167,"n_cols":9,"rows_kept":167,"hidden":true}
["学号","姓名","智育成绩",null,"综合测评总分"]
[2022010461,"吴芷璇",80.0070588235294,1,{"$f":"VLOOKUP(A2,专业排名汇总表!D102:AB267,25,0)","v":{"v":107.52625902177618,"d":"107.5263"}},null,null,2022010364,{"$f":"VLOOKUP(H:H,A:D,4,0)","v":54}]
[2022010498,"陈雨涵",91.285,2,{"$f":"VLOOKUP(A3,专业排名汇总表!D141:AB306,25,0)","v":{"v":101.6691525414594,"d":"101.6692"}},null,null,2022010365,{"$f":"VLOOKUP(H:H,A:D,4,0)","v":10}]
[2022010434,"黄宁",88.8328767123288,3,{"$f":"VLOOKUP(A4,专业排名汇总表!D74:AB239,25,0)","v":{"v":100.09848937516817,"d":"100.0985"}},null,null,2022010366,57]
[2022010455,"王德民",92.9024390243902,4,{"$f":"VLOOKUP(A5,专业排名汇总表!D95:AB260,25,0)","v":{"v":95.20336945738498,"d":"95.2034"}},null,null,2022010367,76]
[2022010433,"陈禾婕",77.1292682926829,5,{"$f":"VLOOKUP(A6,专业排名汇总表!D73:AB238,25,0)","v":{"v":93.06312957202258,"d":"93.0631"}},null,null,2022010368,8]
[2022010373,"王晴宇",90.4588235294118,6,{"$f":"VLOOKUP(A7,专业排名汇总表!D12:AB177,25,0)","v":{"v":93.72976044542901,"d":"93.7298"}},null,null,2022010369,103]
[2022010519,"李佳俊",86.3011764705882,7,{"$f":"VLOOKUP(A8,专业排名汇总表!D162:AB327,25,0)","v":{"v":94.73780819102139,"d":"94.7378"}},null,null,2022010370,161]
[2022010368,"张露",91.909756097561,8,{"$f":"VLOOKUP(A9,专业排名汇总表!D7:AB172,25,0)","v":{"v":93.0456798342092,"d":"93.0457"}},null,null,2022010371,93]
[2022010466,"李春辉",90.9561643835616,9,{"$f":"VLOOKUP(A10,专业排名汇总表!D107:AB272,25,0)","v":{"v":92.89674757646769,"d":"92.8967"}},null,null,2022010372,79]
[2022010365,"杨秋瑶",85.6560975609756,10,{"$f":"VLOOKUP(A11,专业排名汇总表!D4:AB169,25,0)","v":{"v":92.86815175701446,"d":"92.8682"}},null,null,2022010373,6]
[2022010459,"朱行健",84.2517647058824,11,{"$f":"VLOOKUP(A12,专业排名汇总表!D99:AB264,25,0)","v":{"v":94.04376580211247,"d":"94.0438"}},null,null,2022010374,13]
[2022010491,"张志彬",85.2560975609756,12,{"$f":"VLOOKUP(A13,专业排名汇总表!D132:AB297,25,0)","v":{"v":92.23883609936145,"d":"92.2388"}},null,null,2022010376,145]
[2022010374,"袁佳怡",88.1741176470588,13,{"$f":"VLOOKUP(A14,专业排名汇总表!D13:AB178,25,0)","v":{"v":92.48755800974743,"d":"92.4876"}},null,null,2022010377,98]
[2022010452,"康胜",91.1929411764706,14,{"$f":"VLOOKUP(A15,专业排名汇总表!D92:AB257,25,0)","v":{"v":91.91571995099999,"d":"91.9157"}},null,null,2022010378,21]
[2022010408,"许文轲",90.5505882352941,15,{"$f":"VLOOKUP(A16,专业排名汇总表!D48:AB213,25,0)","v":{"v":93.06028380479499,"d":"93.0603"}},null,null,2022010379,91]
[2022010451,"蒋子强",88.1951219512195,16,{"$f":"VLOOKUP(A17,专业排名汇总表!D91:AB256,25,0)","v":{"v":91.62949052941353,"d":"91.6295"}},null,null,2022010380,163]
[2022010436,"孙涵",88.0073170731707,17,{"$f":"VLOOKUP(A18,专业排名汇总表!D76:AB241,25,0)","v":{"v":91.35850144522306,"d":"91.3585"}},null,null,2022010381,159]
[2022010397,"李安然",88.2682352941176,18,{"$f":"VLOOKUP(A19,专业排名汇总表!D37:AB202,25,0)","v":{"v":91.13922553655033,"d":"91.1392"}},null,null,2022010382,80]
[2022010392,"吴照飞",88.4894117647059,19,{"$f":"VLOOKUP(A20,专业排名汇总表!D30:AB195,25,0)","v":{"v":90.61720486172007,"d":"90.6172"}},null,null,2022010383,38]
{"$rows_left_out":147}